Reaction Details
TargetEphrin type-B receptor 4
LigandBDBM50329078
Substrate/Competitorn/a
Meas. Tech.ChEMBL_674154 (CHEMBL1274251)
IC50 55±n/a nM
Citation Bardelle, CBarlaam, BBrooks, NColeman, TCross, DDucray, RGreen, IBrempt, CLOlivier, ARead, J Inhibitors of the tyrosine kinase EphB4. Part 3: identification of non-benzodioxole-based kinase inhibitors. Bioorg Med Chem Lett20:6242-5 (2010) 
 
Ephrin type-B receptor 4
Name:Ephrin type-B receptor 4
Type:Enzyme
Mol. Mass.:108273.51
Organism:Homo sapiens (Human)
Description:P54760
Residue:987
BDBM50329078
NameBDBM50329078
Synonyms:CHEMBL1270279 | N4-(3-chloro-1H-indazol-4-yl)-N2-(3,5-dimorpholinophenyl)pyrimidine-2,4-diamine
TypeSmall organic molecule
Emp. Form.C25H27ClN8O2
Mol. Mass.506.987
SMILESClc1n[nH]c2cccc(Nc3ccnc(Nc4cc(cc(c4)N4CCOCC4)N4CCOCC4)n3)c12