Reaction Details
TargetEphrin type-B receptor 4
LigandBDBM50329079
Substrate/Competitorn/a
Meas. Tech.ChEMBL_674154 (CHEMBL1274251)
IC50 0.9±n/a nM
Citation Bardelle, CBarlaam, BBrooks, NColeman, TCross, DDucray, RGreen, IBrempt, CLOlivier, ARead, J Inhibitors of the tyrosine kinase EphB4. Part 3: identification of non-benzodioxole-based kinase inhibitors. Bioorg Med Chem Lett20:6242-5 (2010) 
 
Ephrin type-B receptor 4
Name:Ephrin type-B receptor 4
Type:Enzyme
Mol. Mass.:108273.51
Organism:Homo sapiens (Human)
Description:P54760
Residue:987
BDBM50329079
NameBDBM50329079
Synonyms:CHEMBL1270280 | N2-(2,6-dimorpholinopyridin-4-yl)-N4-(1H-indazol-4-yl)-N4-methylpyrimidine-2,4-diamine
TypeSmall organic molecule
Emp. Form.C25H29N9O2
Mol. Mass.487.5569
SMILESCN(c1ccnc(Nc2cc(nc(c2)N2CCOCC2)N2CCOCC2)n1)c1cccc2[nH]ncc12