Reaction Details
TargetEphrin type-B receptor 4
LigandBDBM50329080
Substrate/Competitorn/a
Meas. Tech.ChEMBL_674154 (CHEMBL1274251)
IC50 2.6±n/a nM
Citation Bardelle, CBarlaam, BBrooks, NColeman, TCross, DDucray, RGreen, IBrempt, CLOlivier, ARead, J Inhibitors of the tyrosine kinase EphB4. Part 3: identification of non-benzodioxole-based kinase inhibitors. Bioorg Med Chem Lett20:6242-5 (2010) 
 
Ephrin type-B receptor 4
Name:Ephrin type-B receptor 4
Type:Enzyme
Mol. Mass.:108273.51
Organism:Homo sapiens (Human)
Description:P54760
Residue:987
BDBM50329080
NameBDBM50329080
Synonyms:CHEMBL1270378 | N2-(2,6-dimorpholinopyrimidin-4-yl)-N4-(1H-indazol-4-yl)-N4-methylpyrimidine-2,4-diamine
TypeSmall organic molecule
Emp. Form.C24H28N10O2
Mol. Mass.488.5449
SMILESCN(c1ccnc(Nc2cc(nc(n2)N2CCOCC2)N2CCOCC2)n1)c1cccc2[nH]ncc12