Reaction Details
TargetEphrin type-B receptor 4
LigandBDBM50329075
Substrate/Competitorn/a
Meas. Tech.ChEMBL_674155 (CHEMBL1274252)
IC50 8420±n/a nM
Citation Bardelle, CBarlaam, BBrooks, NColeman, TCross, DDucray, RGreen, IBrempt, CLOlivier, ARead, J Inhibitors of the tyrosine kinase EphB4. Part 3: identification of non-benzodioxole-based kinase inhibitors. Bioorg Med Chem Lett20:6242-5 (2010) 
 
Ephrin type-B receptor 4
Name:Ephrin type-B receptor 4
Type:Enzyme
Mol. Mass.:108273.51
Organism:Homo sapiens (Human)
Description:P54760
Residue:987
BDBM50329075
NameBDBM50329075
Synonyms:CHEMBL1270076 N-(3-(4-(1H-indazol-4-ylamino)pyrimidin-2-ylamino)phenyl)methanesulfonamide
TypeSmall organic molecule
Emp. Form.C18H17N7O2S
Mol. Mass.395.438
SMILESCS(=O)(=O)Nc1cccc(Nc2nccc(Nc3cccc4[nH]ncc34)n2)c1