Reaction Details
TargetCytochrome P450 2C19
LigandBDBM50329070
Substrate/Competitorn/a
Meas. Tech.ChEMBL_674172 (CHEMBL1274269)
IC50>10000±n/a nM
Citation Bardelle, CBarlaam, BBrooks, NColeman, TCross, DDucray, RGreen, IBrempt, CLOlivier, ARead, J Inhibitors of the tyrosine kinase EphB4. Part 3: identification of non-benzodioxole-based kinase inhibitors. Bioorg Med Chem Lett20:6242-5 (2010) 
 
Cytochrome P450 2C19
Name:Cytochrome P450 2C19
Type:Enzyme
Mol. Mass.:55935.47
Organism:Homo sapiens (Human)
Description:P33261
Residue:490
BDBM50329070
NameBDBM50329070
Synonyms:CHEMBL1269858 | N2-(3,5-dimorpholinophenyl)-N4-(1H-indazol-4-yl)-N4-methylpyrimidine-2,4-diamine
TypeSmall organic molecule
Emp. Form.C26H30N8O2
Mol. Mass.486.5688
SMILESCN(c1ccnc(Nc2cc(cc(c2)N2CCOCC2)N2CCOCC2)n1)c1cccc2[nH]ncc12