Reaction Details
Target1,4-dihydroxy-2-naphthoyl-CoA synthase
LigandBDBM50329085
Substrate/Competitorn/a
Meas. Tech.ChEMBL_674193 (CHEMBL1274290)
IC50 46300±n/a nM
Citation Li, XLiu, NZhang, HKnudson, SESlayden, RATonge, PJ Synthesis and SAR studies of 1,4-benzoxazine MenB inhibitors: novel antibacterial agents against Mycobacterium tuberculosis. Bioorg Med Chem Lett20:6306-9 (2010) 
 
1,4-dihydroxy-2-naphthoyl-CoA synthase
Name:1,4-dihydroxy-2-naphthoyl-CoA synthase
Type:PROTEIN
Mol. Mass.:34688.06
Organism:Mycobacterium tuberculosis
Description:ChEMBL_817596
Residue:314
BDBM50329085
NameBDBM50329085
Synonyms:(Z)-methyl 2-(6-chloro-2-oxo-2H-benzo[b][1,4]oxazin-3(4H)-ylidene)acetate | CHEMBL1269408
TypeSmall organic molecule
Emp. Form.C11H8ClNO4
Mol. Mass.253.639
SMILESCOC(=O)Cc1nc2cc(Cl)ccc2oc1=O