Reaction Details
TargetCannabinoid receptor 2
LigandBDBM50329132
Substrate/Competitorn/a
Meas. Tech.ChEMBL_674397 (CHEMBL1274726)
Ki 41±n/a nM
Citation Tong, LShankar, BBChen, LRizvi, RKelly, JGilbert, EHuang, CYang, DYKozlowski, JAShih, NYGonsiorek, WHipkin, RWMalikzay, ALunn, CALundell, DJ Expansion of SAR studies on triaryl bis sulfone cannabinoid CB2 receptor ligands. Bioorg Med Chem Lett20:6785-9 (2010) 
 
Cannabinoid receptor 2
Name:Cannabinoid receptor 2
Type:G Protein-Coupled Receptor (GPCR)
Mol. Mass.:39690.94
Organism:Homo sapiens (Human)
Description:P34972
Residue:360
BDBM50329132
NameBDBM50329132
Synonyms:1,1,1-trifluoro-N-((1-(1-(pyridin-3-ylsulfonyl)-1H-indol-2-ylsulfonyl)piperidin-4-yl)methyl)methanesulfonamide | CHEMBL1270887
TypeSmall organic molecule
Emp. Form.C20H21F3N4O6S3
Mol. Mass.566.594
SMILESFC(F)(F)S(=O)(=O)NCC1CCN(CC1)S(=O)(=O)c1cc2ccccc2n1S(=O)(=O)c1cccnc1