Reaction Details
TargetCannabinoid receptor 2
LigandBDBM50329135
Substrate/Competitorn/a
Meas. Tech.ChEMBL_674397 (CHEMBL1274726)
Ki 1.4±n/a nM
Citation Tong, LShankar, BBChen, LRizvi, RKelly, JGilbert, EHuang, CYang, DYKozlowski, JAShih, NYGonsiorek, WHipkin, RWMalikzay, ALunn, CALundell, DJ Expansion of SAR studies on triaryl bis sulfone cannabinoid CB2 receptor ligands. Bioorg Med Chem Lett20:6785-9 (2010) 
 
Cannabinoid receptor 2
Name:Cannabinoid receptor 2
Type:G Protein-Coupled Receptor (GPCR)
Mol. Mass.:39690.94
Organism:Homo sapiens (Human)
Description:P34972
Residue:360
BDBM50329135
NameBDBM50329135
Synonyms:1,1,1-trifluoro-N-((1-(2-(2-fluorophenylsulfonyl)furan-3-ylsulfonyl)piperidin-4-yl)methyl)methanesulfonamide | CHEMBL1270681
TypeSmall organic molecule
Emp. Form.C17H18F4N2O7S3
Mol. Mass.534.523
SMILESFc1ccccc1S(=O)(=O)c1occc1S(=O)(=O)N1CCC(CNS(=O)(=O)C(F)(F)F)CC1