Reaction Details
TargetCannabinoid receptor 2
LigandBDBM50329137
Substrate/Competitorn/a
Meas. Tech.ChEMBL_674397 (CHEMBL1274726)
Ki 0.8±n/a nM
Citation Tong, LShankar, BBChen, LRizvi, RKelly, JGilbert, EHuang, CYang, DYKozlowski, JAShih, NYGonsiorek, WHipkin, RWMalikzay, ALunn, CALundell, DJ Expansion of SAR studies on triaryl bis sulfone cannabinoid CB2 receptor ligands. Bioorg Med Chem Lett20:6785-9 (2010) 
 
Cannabinoid receptor 2
Name:Cannabinoid receptor 2
Type:G Protein-Coupled Receptor (GPCR)
Mol. Mass.:39690.94
Organism:Homo sapiens (Human)
Description:P34972
Residue:360
BDBM50329137
NameBDBM50329137
Synonyms:1,1,1-trifluoro-N-((1-(1-(2-fluorophenylsulfonyl)-5-methoxy-1H-indol-2-ylsulfonyl)piperidin-4-yl)methyl)methanesulfonamide | CHEMBL1270579
TypeSmall organic molecule
Emp. Form.C22H23F4N3O7S3
Mol. Mass.613.623
SMILESCOc1ccc2n(c(cc2c1)S(=O)(=O)N1CCC(CNS(=O)(=O)C(F)(F)F)CC1)S(=O)(=O)c1ccccc1F