Reaction Details
TargetCannabinoid receptor 2
LigandBDBM50329147
Substrate/Competitorn/a
Meas. Tech.ChEMBL_674397 (CHEMBL1274726)
Ki 0.35±n/a nM
Citation Tong, LShankar, BBChen, LRizvi, RKelly, JGilbert, EHuang, CYang, DYKozlowski, JAShih, NYGonsiorek, WHipkin, RWMalikzay, ALunn, CALundell, DJ Expansion of SAR studies on triaryl bis sulfone cannabinoid CB2 receptor ligands. Bioorg Med Chem Lett20:6785-9 (2010) 
 
Cannabinoid receptor 2
Name:Cannabinoid receptor 2
Type:G Protein-Coupled Receptor (GPCR)
Mol. Mass.:39690.94
Organism:Homo sapiens (Human)
Description:P34972
Residue:360
BDBM50329147
NameBDBM50329147
Synonyms:1,1,1-trifluoro-N-((1-(1-(2-fluorophenylsulfonyl)-1H-indol-2-ylsulfonyl)-4-methylpiperidin-4-yl)methyl)methanesulfonamide | CHEMBL1271193
TypeSmall organic molecule
Emp. Form.C22H23F4N3O6S3
Mol. Mass.597.623
SMILESCC1(CNS(=O)(=O)C(F)(F)F)CCN(CC1)S(=O)(=O)c1cc2ccccc2n1S(=O)(=O)c1ccccc1F