Reaction Details
TargetSubstance-P receptor
LigandBDBM50329160
Substrate/Competitorn/a
Meas. Tech.ChEMBL_674420 (CHEMBL1274749)
Ki 0.9±n/a nM
Citation Ratni, HBallard, TMBissantz, CHoffmann, TJablonski, PKnoflach, FKnust, HMalherbe, PNettekoven, MPatiny-Adam, ARiemer, CSchmitt, MSpooren, W Rational design of novel pyrrolidine derivatives as orally active neurokinin-3 receptor antagonists. Bioorg Med Chem Lett20:6735-8 (2010) 
 
Substance-P receptor
Name:Substance-P receptor
Type:G Protein-Coupled Receptor (GPCR)
Mol. Mass.:46254.43
Organism:Homo sapiens (Human)
Description:P25103
Residue:407
BDBM50329160
NameBDBM50329160
Synonyms:2-(3,5-bis(trifluoromethyl)phenyl)-N-((3R,4S)-4-(4-fluorophenyl)pyrrolidin-3-yl)-N,2-dimethylpropanamide | CHEMBL1270785
TypeSmall organic molecule
Emp. Form.C23H23F7N2O
Mol. Mass.476.4303
SMILESCN([C@H]1CNC[C@@H]1c1ccc(F)cc1)C(=O)C(C)(C)c1cc(cc(c1)C(F)(F)F)C(F)(F)F