Reaction Details
TargetSubstance-P receptor
LigandBDBM50329163
Substrate/Competitorn/a
Meas. Tech.ChEMBL_674420 (CHEMBL1274749)
Ki 1.4±n/a nM
Citation Ratni, HBallard, TMBissantz, CHoffmann, TJablonski, PKnoflach, FKnust, HMalherbe, PNettekoven, MPatiny-Adam, ARiemer, CSchmitt, MSpooren, W Rational design of novel pyrrolidine derivatives as orally active neurokinin-3 receptor antagonists. Bioorg Med Chem Lett20:6735-8 (2010) 
 
Substance-P receptor
Name:Substance-P receptor
Type:G Protein-Coupled Receptor (GPCR)
Mol. Mass.:46254.43
Organism:Homo sapiens (Human)
Description:P25103
Residue:407
BDBM50329163
NameBDBM50329163
Synonyms:CHEMBL1269639 | N-((3R,4S)-1-(4-acetylpiperazine-1-carbonyl)-4-(4-fluorophenyl)pyrrolidin-3-yl)-2-(3,5-bis(trifluoromethyl)phenyl)-N,2-dimethylpropanamide
TypeSmall organic molecule
Emp. Form.C30H33F7N4O3
Mol. Mass.630.5968
SMILESCN([C@H]1CN(C[C@@H]1c1ccc(F)cc1)C(=O)N1CCN(CC1)C(C)=O)C(=O)C(C)(C)c1cc(cc(c1)C(F)(F)F)C(F)(F)F