Reaction Details
Target11-beta-hydroxysteroid dehydrogenase type 2
LigandBDBM50329188
Substrate/Competitorn/a
Meas. Tech.ChEMBL_674863 (CHEMBL1272436)
IC50 14.5±n/a nM
Citation Stanetty, CCzollner, LKoller, IShah, PGaware, RCunha, TDOdermatt, AJordis, UKosma, PClassen-Houben, D Synthesis of novel 3-amino and 29-hydroxamic acid derivatives of glycyrrhetinic acid as selective 11ß-hydroxysteroid dehydrogenase 2 inhibitors. Bioorg Med Chem18:7522-41 (2010) 
 
11-beta-hydroxysteroid dehydrogenase type 2
Name:11-beta-hydroxysteroid dehydrogenase type 2
Type:Enzyme
Mol. Mass.:44141.72
Organism:Homo sapiens (Human)
Description:Purified recombinant human 11beta-HSD2.
Residue:405
BDBM50329188
NameBDBM50329188
Synonyms:(3beta,18beta,20beta)-3-Methoxyamino-11-oxo-olean-12-en-29-oic acid hydrochloride | CHEMBL1269877
TypeSmall organic molecule
Emp. Form.C31H49NO4
Mol. Mass.499.7251
SMILESCON[C@H]1CC[C@@]2(C)[C@@H](CC[C@]3(C)[C@@H]2C(=O)C=C2[C@@H]4C[C@](C)(CC[C@]4(C)CC[C@@]32C)C(O)=O)C1(C)C