Reaction Details
Target11-beta-hydroxysteroid dehydrogenase type 2
LigandBDBM50188385
Substrate/Competitorn/a
Meas. Tech.ChEMBL_674863 (CHEMBL1272436)
IC50 750±n/a nM
Citation Stanetty, CCzollner, LKoller, IShah, PGaware, RCunha, TDOdermatt, AJordis, UKosma, PClassen-Houben, D Synthesis of novel 3-amino and 29-hydroxamic acid derivatives of glycyrrhetinic acid as selective 11ß-hydroxysteroid dehydrogenase 2 inhibitors. Bioorg Med Chem18:7522-41 (2010) 
 
11-beta-hydroxysteroid dehydrogenase type 2
Name:11-beta-hydroxysteroid dehydrogenase type 2
Type:Enzyme
Mol. Mass.:44141.72
Organism:Homo sapiens (Human)
Description:Purified recombinant human 11beta-HSD2.
Residue:405
BDBM50188385
NameBDBM50188385
Synonyms:(2S,4aS,6aS,6bR,8aR,10S,12aS,12bR,14bR)-10-acetoxy-2,4a,6a,6b,9,9,12a-heptamethyl-13-oxo-1,2,3,4,4a,5,6,6a,6b,7,8,8a,9,10,11,12,12a,12b,13,14b-icosahydropicene-2-carboxylic acid CHEMBL207413
TypeSmall organic molecule
Emp. Form.C32H48O5
Mol. Mass.512.7205
SMILESCC(=O)O[C@H]1CC[C@@]2(C)[C@@H](CC[C@]3(C)[C@@H]2C(=O)C=C2[C@@H]4C[C@](C)(CC[C@]4(C)CC[C@@]32C)C(O)=O)C1(C)C