Reaction Details
Target11-beta-hydroxysteroid dehydrogenase 1
LigandBDBM50329187
Substrate/Competitorn/a
Meas. Tech.ChEMBL_674864 (CHEMBL1272437)
IC50 61.9±n/a nM
Citation Stanetty, CCzollner, LKoller, IShah, PGaware, RCunha, TDOdermatt, AJordis, UKosma, PClassen-Houben, D Synthesis of novel 3-amino and 29-hydroxamic acid derivatives of glycyrrhetinic acid as selective 11ß-hydroxysteroid dehydrogenase 2 inhibitors. Bioorg Med Chem18:7522-41 (2010) 
 
11-beta-hydroxysteroid dehydrogenase 1
Name:11-beta-hydroxysteroid dehydrogenase 1
Type:Enzyme
Mol. Mass.:32409.16
Organism:Homo sapiens (Human)
Description:P28845
Residue:292
BDBM50329187
NameBDBM50329187
Synonyms:(3alpha,18beta,20beta)-3-Methoxyamino-11-oxo-olean-12-en-29-oic acid hydrochloride | CHEMBL1271410
TypeSmall organic molecule
Emp. Form.C31H49NO4
Mol. Mass.499.7251
SMILESCON[C@@H]1CC[C@@]2(C)[C@@H](CC[C@]3(C)[C@@H]2C(=O)C=C2[C@@H]4C[C@](C)(CC[C@]4(C)CC[C@@]32C)C(O)=O)C1(C)C