Reaction Details
TargetSerine/threonine-protein kinase Chk1
LigandBDBM50329198
Substrate/Competitorn/a
Meas. Tech.ChEMBL_674873 (CHEMBL1272502)
IC50 13±n/a nM
Citation Belanger, DBWilliams, MJCurran, PJMandal, AKMeng, ZRainka, MPYu, TShih, NYSiddiqui, MALiu, MTevar, SLee, SLiang, LGray, KYaremko, BJones, JSmith, EBPrelusky, DBBasso, AD Discovery of orally bioavailable imidazo[1,2-a]pyrazine-based Aurora kinase inhibitors. Bioorg Med Chem Lett20:6739-43 (2010) 
 
Serine/threonine-protein kinase Chk1
Name:Serine/threonine-protein kinase Chk1
Type:Enzyme Catalytic Domain
Mol. Mass.:54443.02
Organism:Homo sapiens (Human)
Description:gi_166295192
Residue:476
BDBM50329198
NameBDBM50329198
Synonyms:2-(ethyl((5-(6-methyl-3-(1H-pyrazol-4-yl)imidazo[1,2-a]pyrazin-8-ylamino)isothiazol-3-yl)methyl)amino)-2-methylpropan-1-ol CHEMBL1232515 | CHEMBL1650533
TypeSmall organic molecule
Emp. Form.C20H26N8OS
Mol. Mass.426.538
SMILESCCN(Cc1cc(Nc2nc(C)cn3c(cnc23)-c2cn[nH]c2)sn1)C(C)(C)CO