Reaction Details
TargetAurora kinase B
LigandBDBM50329196
Substrate/Competitorn/a
Meas. Tech.ChEMBL_674875 (CHEMBL1272504)
IC50 50±n/a nM
Citation Belanger, DBWilliams, MJCurran, PJMandal, AKMeng, ZRainka, MPYu, TShih, NYSiddiqui, MALiu, MTevar, SLee, SLiang, LGray, KYaremko, BJones, JSmith, EBPrelusky, DBBasso, AD Discovery of orally bioavailable imidazo[1,2-a]pyrazine-based Aurora kinase inhibitors. Bioorg Med Chem Lett20:6739-43 (2010) 
 
Aurora kinase B
Name:Aurora kinase B
Type:Protein
Mol. Mass.:39327.72
Organism:Homo sapiens (Human)
Description:Q96GD4
Residue:344
BDBM50329196
NameBDBM50329196
Synonyms:3-(1-((2S,6R)-2,6-dimethylmorpholino)cyclopropyl)-N-(6-methyl-3-(1H-pyrazol-4-yl)imidazo[1,2-a]pyrazin-8-yl)isothiazol-5-amine | CHEMBL1270398
TypeSmall organic molecule
Emp. Form.C22H26N8OS
Mol. Mass.450.56
SMILESC[C@H]1CN(C[C@@H](C)O1)C1(CC1)c1cc(Nc2nc(C)cn3c(cnc23)-c2cn[nH]c2)sn1