Reaction Details
TargetTyrosine-protein kinase Lck
LigandBDBM50329200
Substrate/Competitorn/a
Meas. Tech.ChEMBL_674877 (CHEMBL1272506)
IC50 384±n/a nM
Citation Belanger, DBWilliams, MJCurran, PJMandal, AKMeng, ZRainka, MPYu, TShih, NYSiddiqui, MALiu, MTevar, SLee, SLiang, LGray, KYaremko, BJones, JSmith, EBPrelusky, DBBasso, AD Discovery of orally bioavailable imidazo[1,2-a]pyrazine-based Aurora kinase inhibitors. Bioorg Med Chem Lett20:6739-43 (2010) 
 
Tyrosine-protein kinase Lck
Name:Tyrosine-protein kinase Lck
Type:n/a
Mol. Mass.:57987.83
Organism:Homo sapiens (Human)
Description:P06239
Residue:509
BDBM50329200
NameBDBM50329200
Synonyms:3-((3,3-dimethylmorpholino)methyl)-N-(6-methyl-3-(1H-pyrazol-4-yl)imidazo[1,2-a]pyrazin-8-yl)isothiazol-5-amine | CHEMBL1270897
TypeSmall organic molecule
Emp. Form.C20H24N8OS
Mol. Mass.424.523
SMILESCc1cn2c(cnc2c(Nc2cc(CN3CCOCC3(C)C)ns2)n1)-c1cn[nH]c1