Reaction Details
TargetSodium channel protein type 10 subunit alpha
LigandBDBM50329214
Substrate/Competitorn/a
Meas. Tech.ChEMBL_675099 (CHEMBL1272890)
IC50 210±n/a nM
Citation Kort, MEAtkinson, RNThomas, JBDrizin, IJohnson, MSSecrest, MAGregg, RJScanio, MJShi, LHakeem, AHMatulenko, MAChapman, MLKrambis, MJLiu, DShieh, CCZhang, XSimler, GMikusa, JPZhong, CJoshi, SHonore, PRoeloffs, RWerness, SAntonio, BMarsh, KCFaltynek, CRKrafte, DSJarvis, MFMarron, BE Subtype-selective Na(v)1.8 sodium channel blockers: identification of potent, orally active nicotinamide derivatives. Bioorg Med Chem Lett20:6812-5 (2010) 
 
Sodium channel protein type 10 subunit alpha
Name:Sodium channel protein type 10 subunit alpha
Type:Enzyme
Mol. Mass.:219724.17
Organism:Rattus norvegicus (Rat)
Description:Q62968
Residue:1956
BDBM50329214
NameBDBM50329214
Synonyms:CHEMBL1271415 | N-(3,5-dimethylphenyl)-5-(4-fluorophenyl)nicotinamide
TypeSmall organic molecule
Emp. Form.C20H17FN2O
Mol. Mass.320.3602
SMILESCc1cc(C)cc(NC(=O)c2cncc(c2)-c2ccc(F)cc2)c1