Reaction Details
TargetSodium channel protein type 10 subunit alpha
LigandBDBM50329213
Substrate/Competitorn/a
Meas. Tech.ChEMBL_675097 (CHEMBL1272888)
IC50 9±n/a nM
Citation Kort, MEAtkinson, RNThomas, JBDrizin, IJohnson, MSSecrest, MAGregg, RJScanio, MJShi, LHakeem, AHMatulenko, MAChapman, MLKrambis, MJLiu, DShieh, CCZhang, XSimler, GMikusa, JPZhong, CJoshi, SHonore, PRoeloffs, RWerness, SAntonio, BMarsh, KCFaltynek, CRKrafte, DSJarvis, MFMarron, BE Subtype-selective Na(v)1.8 sodium channel blockers: identification of potent, orally active nicotinamide derivatives. Bioorg Med Chem Lett20:6812-5 (2010) 
 
Sodium channel protein type 10 subunit alpha
Name:Sodium channel protein type 10 subunit alpha
Type:Enzyme
Mol. Mass.:220609.21
Organism:Homo sapiens (Human)
Description:Q9Y5Y9
Residue:1956
BDBM50329213
NameBDBM50329213
Synonyms:5-(4-chlorophenyl)-N-(3,5-dimethylphenyl)nicotinamide | CHEMBL1271416
TypeSmall organic molecule
Emp. Form.C20H17ClN2O
Mol. Mass.336.815
SMILESCc1cc(C)cc(NC(=O)c2cncc(c2)-c2ccc(Cl)cc2)c1