Reaction Details
TargetSodium channel protein type 10 subunit alpha
LigandBDBM50329215
Substrate/Competitorn/a
Meas. Tech.ChEMBL_675097 (CHEMBL1272888)
IC50 26±n/a nM
Citation Kort, MEAtkinson, RNThomas, JBDrizin, IJohnson, MSSecrest, MAGregg, RJScanio, MJShi, LHakeem, AHMatulenko, MAChapman, MLKrambis, MJLiu, DShieh, CCZhang, XSimler, GMikusa, JPZhong, CJoshi, SHonore, PRoeloffs, RWerness, SAntonio, BMarsh, KCFaltynek, CRKrafte, DSJarvis, MFMarron, BE Subtype-selective Na(v)1.8 sodium channel blockers: identification of potent, orally active nicotinamide derivatives. Bioorg Med Chem Lett20:6812-5 (2010) 
 
Sodium channel protein type 10 subunit alpha
Name:Sodium channel protein type 10 subunit alpha
Type:Enzyme
Mol. Mass.:220609.21
Organism:Homo sapiens (Human)
Description:Q9Y5Y9
Residue:1956
BDBM50329215
NameBDBM50329215
Synonyms:CHEMBL1271206 | N-(3,5-dimethylphenyl)-5-(4-(trifluoromethoxy)phenyl)nicotinamide
TypeSmall organic molecule
Emp. Form.C21H17F3N2O2
Mol. Mass.386.3671
SMILESCc1cc(C)cc(NC(=O)c2cncc(c2)-c2ccc(OC(F)(F)F)cc2)c1