Reaction Details
TargetSodium channel protein type 10 subunit alpha
LigandBDBM50329219
Substrate/Competitorn/a
Meas. Tech.ChEMBL_675097 (CHEMBL1272888)
IC50 51±n/a nM
Citation Kort, MEAtkinson, RNThomas, JBDrizin, IJohnson, MSSecrest, MAGregg, RJScanio, MJShi, LHakeem, AHMatulenko, MAChapman, MLKrambis, MJLiu, DShieh, CCZhang, XSimler, GMikusa, JPZhong, CJoshi, SHonore, PRoeloffs, RWerness, SAntonio, BMarsh, KCFaltynek, CRKrafte, DSJarvis, MFMarron, BE Subtype-selective Na(v)1.8 sodium channel blockers: identification of potent, orally active nicotinamide derivatives. Bioorg Med Chem Lett20:6812-5 (2010) 
 
Sodium channel protein type 10 subunit alpha
Name:Sodium channel protein type 10 subunit alpha
Type:Enzyme
Mol. Mass.:220609.21
Organism:Homo sapiens (Human)
Description:Q9Y5Y9
Residue:1956
BDBM50329219
NameBDBM50329219
Synonyms:CHEMBL1270999 | N-(3,5-dimethylphenyl)-2-(4-(trifluoromethoxy)phenyl)thiazole-4-carboxamide
TypeSmall organic molecule
Emp. Form.C19H15F3N2O2S
Mol. Mass.392.395
SMILESCc1cc(C)cc(NC(=O)c2csc(n2)-c2ccc(OC(F)(F)F)cc2)c1