Reaction Details
TargetSodium channel protein type 10 subunit alpha
LigandBDBM50329203
Substrate/Competitorn/a
Meas. Tech.ChEMBL_675096 (CHEMBL1272887)
IC50 87±n/a nM
Citation Kort, MEAtkinson, RNThomas, JBDrizin, IJohnson, MSSecrest, MAGregg, RJScanio, MJShi, LHakeem, AHMatulenko, MAChapman, MLKrambis, MJLiu, DShieh, CCZhang, XSimler, GMikusa, JPZhong, CJoshi, SHonore, PRoeloffs, RWerness, SAntonio, BMarsh, KCFaltynek, CRKrafte, DSJarvis, MFMarron, BE Subtype-selective Na(v)1.8 sodium channel blockers: identification of potent, orally active nicotinamide derivatives. Bioorg Med Chem Lett20:6812-5 (2010) 
 
Sodium channel protein type 10 subunit alpha
Name:Sodium channel protein type 10 subunit alpha
Type:PROTEIN
Mol. Mass.:220545.77
Organism:Mus musculus
Description:ChEMBL_675096
Residue:1958
BDBM50329203
NameBDBM50329203
Synonyms:5-(4-chlorophenyl)-N-((2-(2,2,2-trifluoroethoxy)pyridin-3-yl)methyl)nicotinamide | CHEMBL1270208
TypeSmall organic molecule
Emp. Form.C20H15ClF3N3O2
Mol. Mass.421.8
SMILESFC(F)(F)COc1ncccc1CNC(=O)c1cncc(c1)-c1ccc(Cl)cc1