Reaction Details
TargetSodium channel protein type 10 subunit alpha
LigandBDBM50329208
Substrate/Competitorn/a
Meas. Tech.ChEMBL_675096 (CHEMBL1272887)
IC50 32±n/a nM
Citation Kort, MEAtkinson, RNThomas, JBDrizin, IJohnson, MSSecrest, MAGregg, RJScanio, MJShi, LHakeem, AHMatulenko, MAChapman, MLKrambis, MJLiu, DShieh, CCZhang, XSimler, GMikusa, JPZhong, CJoshi, SHonore, PRoeloffs, RWerness, SAntonio, BMarsh, KCFaltynek, CRKrafte, DSJarvis, MFMarron, BE Subtype-selective Na(v)1.8 sodium channel blockers: identification of potent, orally active nicotinamide derivatives. Bioorg Med Chem Lett20:6812-5 (2010) 
 
Sodium channel protein type 10 subunit alpha
Name:Sodium channel protein type 10 subunit alpha
Type:PROTEIN
Mol. Mass.:220545.77
Organism:Mus musculus
Description:ChEMBL_675096
Residue:1958
BDBM50329208
NameBDBM50329208
Synonyms:5-(4-chlorophenyl)-N-(2-morpholinobenzyl)nicotinamide | CHEMBL1269991
TypeSmall organic molecule
Emp. Form.C23H22ClN3O2
Mol. Mass.407.893
SMILESClc1ccc(cc1)-c1cncc(c1)C(=O)NCc1ccccc1N1CCOCC1