Reaction Details
TargetSodium channel protein type 10 subunit alpha
LigandBDBM50329202
Substrate/Competitorn/a
Meas. Tech.ChEMBL_675096 (CHEMBL1272887)
IC50 190±n/a nM
Citation Kort, MEAtkinson, RNThomas, JBDrizin, IJohnson, MSSecrest, MAGregg, RJScanio, MJShi, LHakeem, AHMatulenko, MAChapman, MLKrambis, MJLiu, DShieh, CCZhang, XSimler, GMikusa, JPZhong, CJoshi, SHonore, PRoeloffs, RWerness, SAntonio, BMarsh, KCFaltynek, CRKrafte, DSJarvis, MFMarron, BE Subtype-selective Na(v)1.8 sodium channel blockers: identification of potent, orally active nicotinamide derivatives. Bioorg Med Chem Lett20:6812-5 (2010) 
 
Sodium channel protein type 10 subunit alpha
Name:Sodium channel protein type 10 subunit alpha
Type:PROTEIN
Mol. Mass.:220545.77
Organism:Mus musculus
Description:ChEMBL_675096
Residue:1958
BDBM50329202
NameBDBM50329202
Synonyms:5-(4-cyanophenyl)-N-(3,5-dimethylphenyl)nicotinamide | CHEMBL1271309
TypeSmall organic molecule
Emp. Form.C21H17N3O
Mol. Mass.327.3792
SMILESCc1cc(C)cc(NC(=O)c2cncc(c2)-c2ccc(cc2)C#N)c1