Reaction Details
TargetSodium channel protein type 10 subunit alpha
LigandBDBM50329218
Substrate/Competitorn/a
Meas. Tech.ChEMBL_675096 (CHEMBL1272887)
IC50 280±n/a nM
Citation Kort, MEAtkinson, RNThomas, JBDrizin, IJohnson, MSSecrest, MAGregg, RJScanio, MJShi, LHakeem, AHMatulenko, MAChapman, MLKrambis, MJLiu, DShieh, CCZhang, XSimler, GMikusa, JPZhong, CJoshi, SHonore, PRoeloffs, RWerness, SAntonio, BMarsh, KCFaltynek, CRKrafte, DSJarvis, MFMarron, BE Subtype-selective Na(v)1.8 sodium channel blockers: identification of potent, orally active nicotinamide derivatives. Bioorg Med Chem Lett20:6812-5 (2010) 
 
Sodium channel protein type 10 subunit alpha
Name:Sodium channel protein type 10 subunit alpha
Type:PROTEIN
Mol. Mass.:220545.77
Organism:Mus musculus
Description:ChEMBL_675096
Residue:1958
BDBM50329218
NameBDBM50329218
Synonyms:CHEMBL1271105 | N-(3,5-dimethylphenyl)-5-(4-(trifluoromethoxy)phenyl)-1,2,4-thiadiazole-3-carboxamide
TypeSmall organic molecule
Emp. Form.C18H14F3N3O2S
Mol. Mass.393.383
SMILESCc1cc(C)cc(NC(=O)c2nsc(n2)-c2ccc(OC(F)(F)F)cc2)c1