Reaction Details
TargetC-C motif chemokine 5
LigandBDBM50329240
Substrate/Competitorn/a
Meas. Tech.ChEMBL_675123 (CHEMBL1272914)
IC50>500±n/a nM
Citation Wanner, JChen, LLemoine, RCKondru, RJekle, AHeilek, GdeRosier, AJi, CBerry, PWRotstein, DM Evaluation of amide replacements in CCR5 antagonists as a means to increase intrinsic permeability. Part 2: SAR optimization and pharmacokinetic profile of a homologous azacyle series. Bioorg Med Chem Lett20:6802-7 (2010) 
 
C-C motif chemokine 5
Name:C-C motif chemokine 5
Type:PROTEIN
Mol. Mass.:9996.11
Organism:Homo sapiens (Human)
Description:ChEMBL_1363187
Residue:91
BDBM50329240
NameBDBM50329240
Synonyms:1-(3-(3-((3aR,6aS)-5-(4,6-dimethylpyrimidine-5-carbonyl)hexahydropyrrolo[3,4-c]pyrrol-2(1H)-yl)-1-phenylpropyl)azetidin-1-yl)-3-methylbutan-1-one | CHEMBL1269992
TypeSmall organic molecule
Emp. Form.C30H41N5O2
Mol. Mass.503.6788
SMILESCC(C)CC(=O)N1CC(C1)C(CCN1C[C@H]2CN(C[C@H]2C1)C(=O)c1c(C)ncnc1C)c1ccccc1