Reaction Details
Target3-oxoacyl-acyl-carrier protein reductase
LigandBDBM50329257
Substrate/Competitorn/a
Meas. Tech.ChEMBL_675156 (CHEMBL1273013)
Ki 6000±n/a nM
Citation Tasdemir, DSanabria, DLauinger, ILTarun, AHerman, RPerozzo, RZloh, MKappe, SHBrun, RCarballeira, NM 2-Hexadecynoic acid inhibits plasmodial FAS-II enzymes and arrests erythrocytic and liver stage Plasmodium infections. Bioorg Med Chem18:7475-85 (2010) 
 
3-oxoacyl-acyl-carrier protein reductase
Name:3-oxoacyl-acyl-carrier protein reductase
Synonyms:n/a
Type:PROTEIN
Mol. Mass.:33333.53
Organism:Plasmodium falciparum
Description:ChEMBL_675156
Residue:301
BDBM50329257
NameBDBM50329257
TypeSmall organic molecule
Emp. Form.C17H30O2
Mol. Mass.266.4189
#CC(O)=O