Reaction Details
TargetLethal factor
LigandBDBM50329270
Substrate/Competitorn/a
Meas. Tech.ChEMBL_675361 (CHEMBL1273398)
Ki 0.30±n/a nM
Citation Jiao, GSKim, SMoayeri, MCregar-Hernandez, LMcKasson, LMargosiak, SALeppla, SHJohnson, AT Antidotes to anthrax lethal factor intoxication. Part 1: Discovery of potent lethal factor inhibitors with in vivo efficacy. Bioorg Med Chem Lett20:6850-3 (2010) 
 
Lethal factor
Name:Lethal factor
Type:PROTEIN
Mol. Mass.:93758.56
Organism:Bacillus anthracis
Description:ChEMBL_1460338
Residue:809
BDBM50329270
NameBDBM50329270
Synonyms:(R)-2-(4-fluoro-3,5-dimethylphenylamino)-N-hydroxy-6-(4-nitrobenzylamino)hexanamide | CHEMBL1270304
TypeSmall organic molecule
Emp. Form.C21H27FN4O4
Mol. Mass.418.4619
SMILESCc1cc(N[C@H](CCCCNCc2ccc(cc2)[N+]([O-])=O)C(=O)NO)cc(C)c1F