Reaction Details
TargetPolyunsaturated fatty acid lipoxygenase ALOX15
LigandBDBM50026081
Substrate/Competitorn/a
Meas. Tech.ChEMBL_675412 (CHEMBL1273492)
Ki<10±n/a nM
Citation Rai, GKenyon, VJadhav, ASchultz, LArmstrong, MJameson, JBHoobler, ELeister, WSimeonov, AHolman, TRMaloney, DJ Discovery of potent and selective inhibitors of human reticulocyte 15-lipoxygenase-1. J Med Chem53:7392-404 (2010) 
 
Polyunsaturated fatty acid lipoxygenase ALOX15
Name:Polyunsaturated fatty acid lipoxygenase ALOX15
Type:Protein
Mol. Mass.:74804.05
Organism:Homo sapiens (Human)
Description:n/a
Residue:662
BDBM50026081
NameBDBM50026081
Synonyms:CHEMBL1270112
TypeSmall organic molecule
Emp. Form.C24H16F2N2O4S
Mol. Mass.466.457
SMILESFC(F)Oc1ccc(cc1)C(=O)OCC#CCSc1nnc(o1)-c1cccc2ccccc12