Reaction Details
TargetAdenosine receptor A2a
LigandBDBM50329364
Substrate/Competitorn/a
Meas. Tech.ChEMBL_675431 (CHEMBL1273568)
Ki 16±n/a nM
Citation McGuinness, BFCole, AGDong, GBrescia, MRShao, YHenderson, IRokosz, LLStauffer, TMMannava, NKimble, EFHicks, CWhite, NWines, PGQuadros, E Discovery of 2-aminoimidazopyridine adenosine A(2A) receptor antagonists. Bioorg Med Chem Lett20:6845-9 (2010) 
 
Adenosine receptor A2a
Name:Adenosine receptor A2a
Type:G Protein-Coupled Receptor (GPCR)
Mol. Mass.:45015.65
Organism:Rattus norvegicus (rat)
Description:Rat A2A receptors expressed in CHO cells.
Residue:410
BDBM50329364
NameBDBM50329364
Synonyms:2-(3-cyanobenzamido)-N,N-diethyl-1-(3-methoxypropyl)-1H-benzo[d]imidazole-6-carboxamide | CHEMBL1269901
TypeSmall organic molecule
Emp. Form.C24H27N5O3
Mol. Mass.433.5029
SMILESCCN(CC)C(=O)c1ccc2nc(NC(=O)c3cccc(c3)C#N)n(CCCOC)c2c1