Reaction Details
TargetAdenosine receptor A2a
LigandBDBM50329366
Substrate/Competitorn/a
Meas. Tech.ChEMBL_675428 (CHEMBL1273565)
Ki 12±n/a nM
Citation McGuinness, BFCole, AGDong, GBrescia, MRShao, YHenderson, IRokosz, LLStauffer, TMMannava, NKimble, EFHicks, CWhite, NWines, PGQuadros, E Discovery of 2-aminoimidazopyridine adenosine A(2A) receptor antagonists. Bioorg Med Chem Lett20:6845-9 (2010) 
 
Adenosine receptor A2a
Name:Adenosine receptor A2a
Type:G Protein-Coupled Receptor (GPCR)
Mol. Mass.:44716.46
Organism:Homo sapiens (Human)
Description:P29274
Residue:412
BDBM50329366
NameBDBM50329366
Synonyms:2-(3-cyanobenzamido)-N-ethyl-3-(3-methoxypropyl)-N-methyl-3H-imidazo[4,5-b]pyridine-5-carboxamide | CHEMBL1270008
TypeSmall organic molecule
Emp. Form.C22H24N6O3
Mol. Mass.420.4644
SMILESCCN(C)C(=O)c1ccc2nc(NC(=O)c3cccc(c3)C#N)n(CCCOC)c2n1