Reaction Details
TargetD(4) dopamine receptor
LigandBDBM50329405
Substrate/Competitorn/a
Meas. Tech.ChEMBL_675650 (CHEMBL1274011)
Ki 1.93±n/a nM
Citation Lacivita, EDe Giorgio, PLee, ITRodeheaver, SIWeiss, BAFracasso, CCaccia, SBerardi, FPerrone, RZhang, MRMaeda, JHiguchi, MSuhara, TSchetz, JALeopoldo, M Design, synthesis, radiolabeling, and in vivo evaluation of carbon-11 labeled N-[2-[4-(3-cyanopyridin-2-yl)piperazin-1-yl]ethyl]-3-methoxybenzamide, a potential positron emission tomography tracer for the dopamine D(4) receptors. J Med Chem53:7344-55 (2010) 
 
D(4) dopamine receptor
Name:D(4) dopamine receptor
Type:Enzyme Catalytic Domain
Mol. Mass.:41307.65
Organism:RAT
Description:DOPAMINE D4.4 0 RAT::P30729
Residue:387
BDBM50329405
NameBDBM50329405
Synonyms:CHEMBL1270013 | N-(2-(4-(benzo[d]isoxazol-3-yl)piperazin-1-yl)ethyl)-3-methoxybenzamide
TypeSmall organic molecule
Emp. Form.C21H24N4O3
Mol. Mass.380.4403
SMILESCOc1cccc(c1)C(=O)NCCN1CCN(CC1)c1noc2ccccc12