Reaction Details
TargetCell division cycle 7-related protein kinase
LigandBDBM50329462
Substrate/Competitorn/a
Meas. Tech.ChEMBL_674074 (CHEMBL1274171)
IC50 114±n/a nM
Citation Menichincheri, MAlbanese, CAlli, CBallinari, DBargiotti, ACaldarelli, MCiavolella, ACirla, AColombo, MColotta, FCroci, VD'Alessio, RD'Anello, MErmoli, AFiorentini, FForte, BGalvani, AGiordano, PIsacchi, AMartina, KMolinari, AMoll, JKMontagnoli, AOrsini, POrzi, FPesenti, EPillan, ARoletto, FScolaro, ATatò, MTibolla, MValsasina, BVarasi, MVianello, PVolpi, DSantocanale, CVanotti, E Cdc7 kinase inhibitors: 5-heteroaryl-3-carboxamido-2-aryl pyrroles as potential antitumor agents. 1. Lead finding. J Med Chem53:7296-315 (2010) 
 
Cell division cycle 7-related protein kinase
Name:Cell division cycle 7-related protein kinase
Type:Protein
Mol. Mass.:63908.16
Organism:Homo sapiens (Human)
Description:O00311
Residue:574
BDBM50329462
NameBDBM50329462
Synonyms:5-(2-Amino-pyrimidin-4-yl)-2-benzo[b]thiophen-2-yl-1H-pyrrole-3-carboxamide US9670191, G5
TypeSmall organic molecule
Emp. Form.C17H13N5OS
Mol. Mass.335.383
SMILESNC(=O)c1cc([nH]c1-c1cc2ccccc2s1)-c1ccnc(N)n1