Reaction Details
TargetTyrosine-protein kinase JAK3
LigandBDBM50329427
Substrate/Competitorn/a
Meas. Tech.ChEMBL_673925 (CHEMBL1275102)
IC50>10000±n/a nM
Citation Menichincheri, MAlbanese, CAlli, CBallinari, DBargiotti, ACaldarelli, MCiavolella, ACirla, AColombo, MColotta, FCroci, VD'Alessio, RD'Anello, MErmoli, AFiorentini, FForte, BGalvani, AGiordano, PIsacchi, AMartina, KMolinari, AMoll, JKMontagnoli, AOrsini, POrzi, FPesenti, EPillan, ARoletto, FScolaro, ATatò, MTibolla, MValsasina, BVarasi, MVianello, PVolpi, DSantocanale, CVanotti, E Cdc7 kinase inhibitors: 5-heteroaryl-3-carboxamido-2-aryl pyrroles as potential antitumor agents. 1. Lead finding. J Med Chem53:7296-315 (2010) 
 
Tyrosine-protein kinase JAK3
Name:Tyrosine-protein kinase JAK3
Type:Protein
Mol. Mass.:125111.08
Organism:Homo sapiens (Human)
Description:P52333
Residue:1124
BDBM50329427
NameBDBM50329427
Synonyms:5-(2-Amino-pyrimidin-4-yl)-2-phenyl-1H-pyrrole-3-carboxamide US9670191, U1
TypeSmall organic molecule
Emp. Form.C15H13N5O
Mol. Mass.279.2966
SMILESNC(=O)c1cc([nH]c1-c1ccccc1)-c1ccnc(N)n1