Reaction Details
TargetCell division cycle 7-related protein kinase
LigandBDBM50329431
Substrate/Competitorn/a
Meas. Tech.ChEMBL_674074 (CHEMBL1274171)
IC50 60.0±n/a nM
Citation Menichincheri, MAlbanese, CAlli, CBallinari, DBargiotti, ACaldarelli, MCiavolella, ACirla, AColombo, MColotta, FCroci, VD'Alessio, RD'Anello, MErmoli, AFiorentini, FForte, BGalvani, AGiordano, PIsacchi, AMartina, KMolinari, AMoll, JKMontagnoli, AOrsini, POrzi, FPesenti, EPillan, ARoletto, FScolaro, ATatò, MTibolla, MValsasina, BVarasi, MVianello, PVolpi, DSantocanale, CVanotti, E Cdc7 kinase inhibitors: 5-heteroaryl-3-carboxamido-2-aryl pyrroles as potential antitumor agents. 1. Lead finding. J Med Chem53:7296-315 (2010) 
 
Cell division cycle 7-related protein kinase
Name:Cell division cycle 7-related protein kinase
Type:Protein
Mol. Mass.:63908.16
Organism:Homo sapiens (Human)
Description:O00311
Residue:574
BDBM50329431
NameBDBM50329431
Synonyms:5-Pyridin-4-yl-2-p-tolyl-1H-pyrrole-3-carboxamide US9670191, A9
TypeSmall organic molecule
Emp. Form.C17H15N3O
Mol. Mass.277.3205
SMILESCc1ccc(cc1)-c1[nH]c(cc1C(N)=O)-c1ccncc1