Reaction Details
TargetCalcium/calmodulin-dependent protein kinase type IV
LigandBDBM50329498
Substrate/Competitorn/a
Meas. Tech.ChEMBL_674287 (CHEMBL1274487)
IC50>60000±n/a nM
Citation Asano, SKomiya, MKoike, NKoga, ENakatani, SIsobe, Y 5,6,7,8-Tetrahydropyrido[4,3-d]pyrimidines as novel class of potent and highly selective CaMKII inhibitors. Bioorg Med Chem Lett20:6696-8 (2010) 
 
Calcium/calmodulin-dependent protein kinase type IV
Name:Calcium/calmodulin-dependent protein kinase type IV
Type:PROTEIN
Mol. Mass.:51919.87
Organism:Homo sapiens (Human)
Description:ChEMBL_1459854
Residue:473
BDBM50329498
NameBDBM50329498
Synonyms:CHEMBL1271447 | N-(6-benzyl-2-(phenethylamino)-5,6,7,8-tetrahydropyrido[4,3-d]pyrimidin-4-yl)naphthalene-2-sulfonamide
TypeSmall organic molecule
Emp. Form.C32H31N5O2S
Mol. Mass.549.686
SMILESO=S(=O)(Nc1nc(NCCc2ccccc2)nc2CCN(Cc3ccccc3)Cc12)c1ccc2ccccc2c1