Reaction Details
TargetMitogen-activated protein kinase 14
LigandBDBM50329499
Substrate/Competitorn/a
Meas. Tech.ChEMBL_674289 (CHEMBL1274489)
IC50 11000±n/a nM
Citation Asano, SKomiya, MKoike, NKoga, ENakatani, SIsobe, Y 5,6,7,8-Tetrahydropyrido[4,3-d]pyrimidines as novel class of potent and highly selective CaMKII inhibitors. Bioorg Med Chem Lett20:6696-8 (2010) 
 
Mitogen-activated protein kinase 14
Name:Mitogen-activated protein kinase 14
Type:Serine/threonine-protein kinase
Mol. Mass.:41286.76
Organism:Homo sapiens (Human)
Description:Q16539
Residue:360
BDBM50329499
NameBDBM50329499
Synonyms:CHEMBL1270331 | N-(6-benzyl-2-(phenethylamino)-5,6,7,8-tetrahydropyrido[4,3-d]pyrimidin-4-yl)-3-chloro-2-methylbenzenesulfonamide
TypeSmall organic molecule
Emp. Form.C29H30ClN5O2S
Mol. Mass.548.099
SMILESCc1c(Cl)cccc1S(=O)(=O)Nc1nc(NCCc2ccccc2)nc2CCN(Cc3ccccc3)Cc12