Reaction Details
TargetBeta-secretase 1
LigandBDBM50303731
Substrate/Competitorn/a
Meas. Tech.ChEMBL_674717 (CHEMBL1273970)
IC50 20±n/a nM
Citation Malamas, MSRobichaud, AErdei, JQuagliato, DSolvibile, WZhou, PMorris, KTurner, JWagner, EFan, KOlland, AJacobsen, SReinhart, PRiddell, DPangalos, M Design and synthesis of aminohydantoins as potent and selective humanß-secretase (BACE1) inhibitors with enhanced brain permeability. Bioorg Med Chem Lett20:6597-605 (2010) 
 
Beta-secretase 1
Name:Beta-secretase 1
Type:Protein
Mol. Mass.:55755.10
Organism:Homo sapiens (Human)
Description:P56817
Residue:501
BDBM50303731
NameBDBM50303731
Synonyms:(5R)-2-amino-5-(4-fluoro-3-pyrimidin-5-ylphenyl)-3-methyl-5-[4-(trifluoromethoxy)phenyl]-3,5-dihydro-4H-imidazol-4-one CHEMBL568115
TypeSmall organic molecule
Emp. Form.C21H15F4N5O2
Mol. Mass.445.3697
SMILESCN1C(N)=N[C@](C1=O)(c1ccc(OC(F)(F)F)cc1)c1ccc(F)c(c1)-c1cncnc1