Reaction Details
TargetBeta-secretase 1
LigandBDBM50329571
Substrate/Competitorn/a
Meas. Tech.ChEMBL_674717 (CHEMBL1273970)
IC50 12±n/a nM
Citation Malamas, MSRobichaud, AErdei, JQuagliato, DSolvibile, WZhou, PMorris, KTurner, JWagner, EFan, KOlland, AJacobsen, SReinhart, PRiddell, DPangalos, M Design and synthesis of aminohydantoins as potent and selective humanß-secretase (BACE1) inhibitors with enhanced brain permeability. Bioorg Med Chem Lett20:6597-605 (2010) 
 
Beta-secretase 1
Name:Beta-secretase 1
Type:Protein
Mol. Mass.:55755.10
Organism:Homo sapiens (Human)
Description:P56817
Residue:501
BDBM50329571
NameBDBM50329571
Synonyms:(R)-2-amino-4-(4-(difluoromethoxy)phenyl)-4-(4-fluoro-3-(3-methoxyprop-1-ynyl)phenyl)-1-methyl-1H-imidazol-5(4H)-one | CHEMBL1270526
TypeSmall organic molecule
Emp. Form.C21H18F3N3O3
Mol. Mass.417.3811
SMILESCOCC#Cc1cc(ccc1F)[C@]1(N=C(N)N(C)C1=O)c1ccc(OC(F)F)cc1