Reaction Details
TargetBeta-secretase 1
LigandBDBM50329517
Substrate/Competitorn/a
Meas. Tech.ChEMBL_674717 (CHEMBL1273970)
IC50 10±n/a nM
Citation Malamas, MSRobichaud, AErdei, JQuagliato, DSolvibile, WZhou, PMorris, KTurner, JWagner, EFan, KOlland, AJacobsen, SReinhart, PRiddell, DPangalos, M Design and synthesis of aminohydantoins as potent and selective humanß-secretase (BACE1) inhibitors with enhanced brain permeability. Bioorg Med Chem Lett20:6597-605 (2010) 
 
Beta-secretase 1
Name:Beta-secretase 1
Type:Protein
Mol. Mass.:55755.10
Organism:Homo sapiens (Human)
Description:P56817
Residue:501
BDBM50329517
NameBDBM50329517
Synonyms:(R)-2-amino-4-(4-(difluoromethoxy)phenyl)-4-(3-(2-fluoropyridin-3-yl)phenyl)-1-methyl-1H-imidazol-5(4H)-one | CHEMBL1271244
TypeSmall organic molecule
Emp. Form.C22H17F3N4O2
Mol. Mass.426.3912
SMILESCN1C(N)=N[C@](C1=O)(c1ccc(OC(F)F)cc1)c1cccc(c1)-c1cccnc1F