Reaction Details
TargetBeta-secretase 1
LigandBDBM50329546
Substrate/Competitorn/a
Meas. Tech.ChEMBL_674726 (CHEMBL1273979)
EC50 330±n/a nM
Citation Malamas, MSRobichaud, AErdei, JQuagliato, DSolvibile, WZhou, PMorris, KTurner, JWagner, EFan, KOlland, AJacobsen, SReinhart, PRiddell, DPangalos, M Design and synthesis of aminohydantoins as potent and selective humanß-secretase (BACE1) inhibitors with enhanced brain permeability. Bioorg Med Chem Lett20:6597-605 (2010) 
 
Beta-secretase 1
Name:Beta-secretase 1
Type:Protein
Mol. Mass.:55755.10
Organism:Homo sapiens (Human)
Description:P56817
Residue:501
BDBM50329546
NameBDBM50329546
Synonyms:(R)-2-amino-4-(4-(difluoromethoxy)phenyl)-4-(3-(3-fluoroprop-1-ynyl)phenyl)-1-methyl-1H-imidazol-5(4H)-one | CHEMBL1271037
TypeSmall organic molecule
Emp. Form.C20H16F3N3O2
Mol. Mass.387.3551
SMILESCN1C(N)=N[C@](C1=O)(c1ccc(OC(F)F)cc1)c1cccc(c1)C#CCF