Reaction Details
TargetCathepsin D
LigandBDBM50329549
Substrate/Competitorn/a
Meas. Tech.ChEMBL_674724 (CHEMBL1273977)
IC50 4800±n/a nM
Citation Malamas, MSRobichaud, AErdei, JQuagliato, DSolvibile, WZhou, PMorris, KTurner, JWagner, EFan, KOlland, AJacobsen, SReinhart, PRiddell, DPangalos, M Design and synthesis of aminohydantoins as potent and selective humanß-secretase (BACE1) inhibitors with enhanced brain permeability. Bioorg Med Chem Lett20:6597-605 (2010) 
 
Cathepsin D
Name:Cathepsin D
Type:Enzyme
Mol. Mass.:44551.72
Organism:Homo sapiens (Human)
Description:Human proCathepsin D (SwissProt accession number P07339) was expressed in Sf9 cells, purified, and autoactivated.
Residue:412
BDBM50329549
NameBDBM50329549
Synonyms:(R)-2-amino-4-(4-(difluoromethoxy)phenyl)-1-methyl-4-(3-(3-methylbut-1-ynyl)phenyl)-1H-imidazol-5(4H)-one | CHEMBL1271245
TypeSmall organic molecule
Emp. Form.C22H21F2N3O2
Mol. Mass.397.4178
SMILESCC(C)C#Cc1cccc(c1)[C@]1(N=C(N)N(C)C1=O)c1ccc(OC(F)F)cc1