Reaction Details
TargetCarbonic anhydrase 9
LigandBDBM50329585
Substrate/Competitorn/a
Meas. Tech.ChEMBL_674959 (CHEMBL1272636)
Ki 83±n/a nM
Citation Gluszok, SFrédérick, RFoulon, CKlupsch, FSupuran, CTVullo, DScozzafava, AGoossens, JFMasereel, BDepreux, PGoossens, L Design, solid-phase synthesis, and biological evaluation of novel 1,5-diarylpyrrole-3-carboxamides as carbonic anhydrase IX inhibitors. Bioorg Med Chem18:7392-401 (2010) 
 
Carbonic anhydrase 9
Name:Carbonic anhydrase 9
Type:Enzyme
Mol. Mass.:49669.03
Organism:Homo sapiens (Human)
Description:Catalytic domain of human cloned isozyme was used in the assay
Residue:459
BDBM50329585
NameBDBM50329585
Synonyms:CHEMBL1270939 | N3-[2-(Dimethylamino)ethyl]-1-[4-(aminosulfonyl)phenyl]-2-methyl-5-(4-biphenylyl)-1H-3 pyrrolecarboxamide
TypeSmall organic molecule
Emp. Form.C28H30N4O3S
Mol. Mass.502.628
SMILESCN(C)CCNC(=O)c1cc(-c2ccc(cc2)-c2ccccc2)n(c1C)-c1ccc(cc1)S(N)(=O)=O