Reaction Details
TargetCarbonic anhydrase 2
LigandBDBM50329603
Substrate/Competitorn/a
Meas. Tech.ChEMBL_674958 (CHEMBL1272635)
Ki 9±n/a nM
Citation Gluszok, SFrédérick, RFoulon, CKlupsch, FSupuran, CTVullo, DScozzafava, AGoossens, JFMasereel, BDepreux, PGoossens, L Design, solid-phase synthesis, and biological evaluation of novel 1,5-diarylpyrrole-3-carboxamides as carbonic anhydrase IX inhibitors. Bioorg Med Chem18:7392-401 (2010) 
 
Carbonic anhydrase 2
Name:Carbonic anhydrase 2
Type:Enzyme
Mol. Mass.:29250.71
Organism:Homo sapiens (Human)
Description:P00918
Residue:260
BDBM50329603
NameBDBM50329603
Synonyms:CHEMBL1270532 | N-(Piperidino-1-ethyl)-1-[4-(aminosulfonyl)phenyl]-2-methyl-5-(2-naphthyl)-1H-pyrrole-3-carboxamide
TypeSmall organic molecule
Emp. Form.C29H32N4O3S
Mol. Mass.516.654
SMILESCc1c(cc(-c2ccc3ccccc3c2)n1-c1ccc(cc1)S(N)(=O)=O)C(=O)NCCN1CCCCC1