Reaction Details
TargetGABA-A receptor; alpha-5/beta-3/gamma-2
LigandBDBM50329639
Substrate/Competitorn/a
Meas. Tech.ChEMBL_675482 (CHEMBL1273619)
Ki 4.61±n/a nM
Citation Yin, WMajumder, SClayton, TPetrou, SVanLinn, MLNamjoshi, OAMa, CCromer, BARoth, BLPlatt, DMCook, JM Design, synthesis, and subtype selectivity of 3,6-disubstitutedß-carbolines at Bz/GABA(A)ergic receptors. SAR and studies directed toward agents for treatment of alcohol abuse. Bioorg Med Chem18:7548-64 (2010) 
 
GABA-A receptor; alpha-5/beta-3/gamma-2
Name:GABA-A receptor; alpha-5/beta-3/gamma-2
Type:n/a
Mol. Mass.:n/a
Description:ASSAY_ID of ChEMBL is 2148177
Components:This complex has 3 components.
Component 1
Name:Gamma-aminobutyric acid receptor subunit gamma-2
Synonyms:GABA(A) receptor subunit gamma-2 GBRG2_HUMAN
Type:PROTEIN
Mol. Mass.:54172.74
Organism:Homo sapiens (Human)
Description:EBI_217
Residue:467
Component 2
Name:Gamma-aminobutyric acid receptor subunit beta-3
Synonyms:GABA A receptor alpha-4/beta-3/gamma-2 GABA-A receptor GBRB3_HUMAN | agonist GABA site
Type:PROTEIN
Mol. Mass.:54130.51
Organism:Homo sapiens (Human)
Description:ChEMBL_448071
Residue:473
Component 3
Name:Gamma-aminobutyric acid receptor subunit alpha-5
Synonyms:GABA receptor alpha-5 subunit GABRA5 Gamma-aminobutyric acid receptor subunit alpha-5 (GABA(A)) | Gamma-aminobutyric acid receptor subunit alpha-5 (GABAA)
Type:Enzyme
Mol. Mass.:52160.59
Organism:Homo sapiens (Human)
Description:P31644
Residue:462
BDBM50329639
NameBDBM50329639
Synonyms:CHEMBL1270540 | tert-butyl 6-fluoro-9H-pyrido[3,4-b]indole-3-carboxylate
TypeSmall organic molecule
Emp. Form.C16H15FN2O2
Mol. Mass.286.3009
SMILESCC(C)(C)OC(=O)c1cc2c(cn1)[nH]c1ccc(F)cc21