Reaction Details
TargetGamma-aminobutyric acid receptor subunit alpha-3/beta-3/gamma-2
LigandBDBM50244035
Substrate/Competitorn/a
Meas. Tech.ChEMBL_675480 (CHEMBL1273617)
Ki 5.7±n/a nM
Citation Yin, WMajumder, SClayton, TPetrou, SVanLinn, MLNamjoshi, OAMa, CCromer, BARoth, BLPlatt, DMCook, JM Design, synthesis, and subtype selectivity of 3,6-disubstitutedß-carbolines at Bz/GABA(A)ergic receptors. SAR and studies directed toward agents for treatment of alcohol abuse. Bioorg Med Chem18:7548-64 (2010) 
 
Gamma-aminobutyric acid receptor subunit alpha-3/beta-3/gamma-2
Name:Gamma-aminobutyric acid receptor subunit alpha-3/beta-3/gamma-2
Type:n/a
Mol. Mass.:n/a
Description:ASSAY_ID of EBI is 68410
Components:This complex has 3 components.
Component 1
Name:Gamma-aminobutyric acid receptor subunit gamma-2
Synonyms:GABA(A) receptor subunit gamma-2 GBRG2_HUMAN
Type:PROTEIN
Mol. Mass.:54172.74
Organism:Homo sapiens (Human)
Description:EBI_217
Residue:467
Component 2
Name:Gamma-aminobutyric acid receptor subunit beta-3
Synonyms:GABA A receptor alpha-4/beta-3/gamma-2 GABA-A receptor GBRB3_HUMAN | agonist GABA site
Type:PROTEIN
Mol. Mass.:54130.51
Organism:Homo sapiens (Human)
Description:ChEMBL_448071
Residue:473
Component 3
Name:Gamma-aminobutyric acid receptor subunit alpha-3
Synonyms:GABA A Alpha3Beta3Gamma2 GABA C GABA-A receptor GBRA3_HUMAN agonist GABA site
Type:Enzyme Catalytic Domain
Mol. Mass.:55175.47
Organism:Homo sapiens (Human)
Description:GABA A Alpha3Beta1Gamma2 0 HUMAN::P34903
Residue:492
BDBM50244035
NameBDBM50244035
Synonyms:Beta CCE cid_105078 | ethyl 9H-pyrido[3,4-b]indole-3-carboxylate
TypeSmall organic molecule
Emp. Form.C14H12N2O2
Mol. Mass.240.2573
SMILESCCOC(=O)c1cc2c(cn1)[nH]c1ccccc21