Reaction Details
Target5-hydroxytryptamine receptor 3A
LigandBDBM50329732
Substrate/Competitorn/a
Meas. Tech.ChEMBL_674333 (CHEMBL1274533)
Ki 16.3±n/a nM
Citation Yang, ZFairfax, DJMaeng, JHMasih, LUsyatinsky, AHassler, CIsaacson, SFitzpatrick, KDeOrazio, RJChen, JHarding, JPIsherwood, MDobritsa, SChristensen, KLWierschke, JDBliss, BIPeterson, LHBeer, CMCioffi, CLynch, MRennells, WMRichards, JJRust, TKhmelnitsky, YLCohen, MLManning, DD Discovery of 2-substituted benzoxazole carboxamides as 5-HT3 receptor antagonists. Bioorg Med Chem Lett20:6538-41 (2010) 
 
5-hydroxytryptamine receptor 3A
Name:5-hydroxytryptamine receptor 3A
Type:Protein
Mol. Mass.:55283.27
Organism:Homo sapiens (Human)
Description:P46098
Residue:478
BDBM50329732
NameBDBM50329732
Synonyms:CHEMBL1272175 | endo-2-(4-fluorophenyl)-N-((1R,5R)-9-methyl-9-azabicyclo[3.3.1]nonan-3-yl)benzo[d]oxazole-4-carboxamide
TypeSmall organic molecule
Emp. Form.C23H24FN3O2
Mol. Mass.393.454
SMILESCN1[C@@H]2CCC[C@@H]1CC(C2)NC(=O)c1cccc2oc(nc12)-c1ccc(F)cc1