Reaction Details
Target5-hydroxytryptamine receptor 3A
LigandBDBM50329753
Substrate/Competitorn/a
Meas. Tech.ChEMBL_674333 (CHEMBL1274533)
Ki 59.4±n/a nM
Citation Yang, ZFairfax, DJMaeng, JHMasih, LUsyatinsky, AHassler, CIsaacson, SFitzpatrick, KDeOrazio, RJChen, JHarding, JPIsherwood, MDobritsa, SChristensen, KLWierschke, JDBliss, BIPeterson, LHBeer, CMCioffi, CLynch, MRennells, WMRichards, JJRust, TKhmelnitsky, YLCohen, MLManning, DD Discovery of 2-substituted benzoxazole carboxamides as 5-HT3 receptor antagonists. Bioorg Med Chem Lett20:6538-41 (2010) 
 
5-hydroxytryptamine receptor 3A
Name:5-hydroxytryptamine receptor 3A
Type:Protein
Mol. Mass.:55283.27
Organism:Homo sapiens (Human)
Description:P46098
Residue:478
BDBM50329753
NameBDBM50329753
Synonyms:CHEMBL1271959 | endo-2-((2R,6R)-2,6-dimethylpiperazin-1-yl)-N-((1R,5R)-9-methyl-9-azabicyclo[3.3.1]nonan-3-yl)benzo[d]oxazole-4-carboxamide
TypeSmall organic molecule
Emp. Form.C23H33N5O2
Mol. Mass.411.5404
SMILESC[C@@H]1CNC[C@@H](C)N1c1nc2c(cccc2o1)C(=O)NC1C[C@H]2CCC[C@H](C1)N2C