Reaction Details
Target5-hydroxytryptamine receptor 3A
LigandBDBM50329727
Substrate/Competitorn/a
Meas. Tech.ChEMBL_674333 (CHEMBL1274533)
Ki 32.7±n/a nM
Citation Yang, ZFairfax, DJMaeng, JHMasih, LUsyatinsky, AHassler, CIsaacson, SFitzpatrick, KDeOrazio, RJChen, JHarding, JPIsherwood, MDobritsa, SChristensen, KLWierschke, JDBliss, BIPeterson, LHBeer, CMCioffi, CLynch, MRennells, WMRichards, JJRust, TKhmelnitsky, YLCohen, MLManning, DD Discovery of 2-substituted benzoxazole carboxamides as 5-HT3 receptor antagonists. Bioorg Med Chem Lett20:6538-41 (2010) 
 
5-hydroxytryptamine receptor 3A
Name:5-hydroxytryptamine receptor 3A
Type:Protein
Mol. Mass.:55283.27
Organism:Homo sapiens (Human)
Description:P46098
Residue:478
BDBM50329727
NameBDBM50329727
Synonyms:(S)-2-cyclopropyl-N-(quinuclidin-3-yl)benzo[d]oxazole-4-carboxamide | CHEMBL1272072
TypeSmall organic molecule
Emp. Form.C18H21N3O2
Mol. Mass.311.3782
SMILESO=C(N[C@@H]1CN2CCC1CC2)c1cccc2oc(nc12)C1CC1